Target
Methionine aminopeptidase 1
Ligand
BDBM17589
Substrate
Octapeptide substrate
Meas. Tech.
MetAP Enzyme Activity Assay
pH
7.4±n/a
Temperature
295.15±n/a K
IC50
370±n/a nM
Citation
 Wang, JSheppard, GSLou, PKawai, MBaMaung, NErickson, SATucker-Garcia, LPark, CBouska, JWang, YCFrost, DTapang, PAlbert, DHMorgan, SJMorowitz, MShusterman, SMaris, JMLesniewski, RHenkin, J Tumor suppression by a rationally designed reversible inhibitor of methionine aminopeptidase-2. Cancer Res 63:7861-9 (2003) Target
Name:
Methionine aminopeptidase 1
Synonyms:
Aminopeptidase MAP 1 METAP1 Methionine Aminopeptidase Type 1 (MetAP1) | Peptidase M 1
Type:
Enzyme
Mol. Mass.:
43220.79
Organism:
Homo sapiens (Human)
Description:
MetAP1 with an N-terminal six histidine tag was expressed in baculovirus infected sf9 cells.
Residue:
386
  
Inhibitor
Name:
BDBM17589
Synonyms:
(2S,3R)-3-amino-5-(ethylsulfanyl)-2-hydroxy-N-[(1S)-1-(naphthalen-1-yl)ethyl]pentanamide CHEMBL352943 | bestatin-type inhibitor, 4
Type:
Small organic molecule
Emp. Form.:
C19H26N2O2S
Mol. Mass.:
346.487
SMILES:
CCSCC[C@@H](N)[C@H](O)C(=O)N[C@@H](C)c1cccc2ccccc12
:
Substrate
Name:
Octapeptide substrate
Synonyms:
Type:
Peptide
Mol. Mass.:
819.07
Organism:
Description:
Residue:
8
MGKVKVGV