Target
Mitogen-activated protein kinase 14
Ligand
BDBM17697
Substrate
biotinylated GST-ATF2
Meas. Tech.
HTRF Kinase Inhibition Assay
IC50
>40000±n/a nM
Citation
 Potashman, MHBready, JCoxon, ADemelfi, TMDipietro, LDoerr, NElbaum, DEstrada, JGallant, PGermain, JGu, YHarmange, JCKaufman, SAKendall, RKim, JLKumar, GNLong, AMNeervannan, SPatel, VFPolverino, ARose, PPlas, SVWhittington, DZanon, RZhao, H Design, Synthesis, and Evaluation of Orally Active Benzimidazoles and Benzoxazoles as Vascular Endothelial Growth Factor-2 Receptor Tyrosine Kinase Inhibitors. J Med Chem 50:4351-4373 (2007)  
Target
Name:
Mitogen-activated protein kinase 14
Synonyms:
CSAID-binding protein CSBP1 CSPB1 MAP kinase 14 MAP kinase p38 alpha MAPK14 MK14_HUMAN Mitogen-activated protein kinase p38 alpha Stress-activated protein kinase 2a | p38 MAP kinase alpha/beta
Type:
Serine/threonine-protein kinase
Mol. Mass.:
41286.76
Organism:
Homo sapiens (Human)
Description:
Q16539
Residue:
360
  
Inhibitor
Name:
BDBM17697
Synonyms:
2-aminobenzoxazole, 22 | 4-({2-[(4-chloro-3-{[(2S)-1-methylpyrrolidin-2-yl]methoxy}phenyl)amino]-1,3-benzoxazol-5-yl}oxy)-N-methylpyridine-2-carboxamide
Type:
Small organic molecule
Emp. Form.:
C26H26ClN5O4
Mol. Mass.:
507.969
SMILES:
CNC(=O)c1cc(Oc2ccc3oc(Nc4ccc(Cl)c(OC[C@@H]5CCCN5C)c4)nc3c2)ccn1
:
Substrate
Name:
biotinylated GST-ATF2
Synonyms:
ATF-2-GST Activating transcription factor 2 GST-ATF2 biotinylated activating transcription factor 2
Type:
Other Protein Type
Mol. Mass.:
12237.77
Organism:
Homo sapiens (Human)
Description:
Residue:
109