Target
Tyrosine-protein kinase JAK3
Ligand
BDBM17715
Substrate
Not Specified
Meas. Tech.
HTRF Kinase Inhibition Assay
IC50
26±n/a nM
Citation
 Martin, MWNewcomb, JNunes, JJBemis, JEMcGowan, DCWhite, RDBuchanan, JLDiMauro, EFBoucher, CFaust, THsieh, FHuang, XLee, JHSchneider, STurci, SMZhu, X Discovery of novel 2,3-diarylfuro[2,3-b]pyridin-4-amines as potent and selective inhibitors of Lck: synthesis, SAR, and pharmacokinetic properties. Bioorg Med Chem Lett 17:2299-304 (2007)  
Target
Name:
Tyrosine-protein kinase JAK3
Synonyms:
JAK-3 JAK3_HUMAN Janus kinase 3 (JAK3) L-JAK | Leukocyte janus kinase
Type:
Protein
Mol. Mass.:
125111.08
Organism:
Homo sapiens (Human)
Description:
P52333
Residue:
1124
  
Inhibitor
Name:
BDBM17715
Synonyms:
2,3-Diarylfuro[2,3-b]pyridine-4-amine, 6 | N-[(2S)-oxolan-2-ylmethyl]-2,3-diphenylfuro[2,3-b]pyridin-4-amine
Type:
Small organic molecule
Emp. Form.:
C24H22N2O2
Mol. Mass.:
370.4437
SMILES:
C(Nc1ccnc2oc(c(-c3ccccc3)c12)-c1ccccc1)[C@@H]1CCCO1
:
Substrate
Name:
Not Specified
Synonyms:
Type:
Mol. Mass.:
358.43
Organism:
Description:
Residue:
3
NA