Target
Monocarboxylate transporter 4
Ligand
BDBM356806
Substrate
Meas. Tech.
MCT4-Mediated Lactate Transport in MDA-MB-231 Breast Cancer Cells
IC50
1.70±n/a nM
Citation
 Parnell, KMMcCall, JRomero, D Heterocyclic inhibitors of MCT4 US Patent  US10214492 Publication Date 2/26/2019 
Target
Name:
Monocarboxylate transporter 4
Synonyms:
MCT 4 MCT4 SLC16A3 | Solute carrier family 16 member 3
Type:
PROTEIN
Mol. Mass.:
49474.36
Organism:
Homo sapiens (Human)
Description:
ChEMBL_104604
Residue:
465
  
Inhibitor
Name:
BDBM356806
Synonyms:
US10214492, Example 168 | US11292767, Example 168
Type:
Small organic molecule
Emp. Form.:
C27H30N4O4
Mol. Mass.:
474.5515
SMILES:
Cn1ncc2cccc(-n3nc(COC(C)(C)C(O)=O)cc3-c3cccc(OCC4CCC4)c3)c12
: