Target
Tryptophan 5-hydroxylase 2
Ligand
BDBM357737
Substrate
Meas. Tech.
In Vitro Enzyme Activity Assay
IC50
14.0±n/a nM
Citation
 Bader, MSpecker, EMatthes, SSchütz, AMallow, KGrohmann, MNazaré, M Xanthine derivatives, their use as a medicament, and pharmaceutical preparations comprising the same US Patent  US10214530 Publication Date 2/26/2019 
Target
Name:
Tryptophan 5-hydroxylase 2
Synonyms:
NTPH TPH2_HUMAN
Type:
PROTEIN
Mol. Mass.:
56055.12
Organism:
Homo sapiens (Human)
Description:
ChEMBL_487490
Residue:
490
  
Inhibitor
Name:
BDBM357737
Synonyms:
KM-05-166/(I-206) | US10214530, Example 24
Type:
Small organic molecule
Emp. Form.:
C23H20N6O4
Mol. Mass.:
444.4427
SMILES:
CCn1c2nc(Cc3nc4cc5OCOc5cc4[nH]3)n(Cc3ccccc3)c2c(=O)[nH]c1=O
: