Target
Procathepsin L
Ligand
BDBM19541
Substrate
BDBM19480
Meas. Tech.
Enzyme Inhibition Assay
IC50
1857±n/a nM
Citation
 Li, CSDeschenes, DDesmarais, SFalgueyret, JPGauthier, JYKimmel, DBLéger, SMassé, FMcGrath, MEMcKay, DJPercival, MDRiendeau, DRodan, SBThérien, MTruong, VLWesolowski, GZamboni, RBlack, WC Identification of a potent and selective non-basic cathepsin K inhibitor. Bioorg Med Chem Lett 16:1985-9 (2006)  
Target
Name:
Procathepsin L
Synonyms:
CATL1_HUMAN CTSL CTSL1 Cathepsin L Cathepsin L1 heavy chain MEP cathepsin L preproprotein
Type:
Enzyme
Mol. Mass.:
37557.19
Organism:
Homo sapiens (Human)
Description:
Purchased from Calbiochem (San Diego, CA).
Residue:
333
  
Inhibitor
Name:
BDBM19541
Synonyms:
(2S)-N-(cyanomethyl)-4-methyl-2-{[(1S)-2,2,2-trifluoro-1-[4-(pyrimidin-2-yl)phenyl]ethyl]amino}pentanamide | trifluoroethylamine analogue, 31
Type:
Small organic molecule
Emp. Form.:
C20H22F3N5O
Mol. Mass.:
405.4168
SMILES:
CC(C)C[C@H](N[C@@H](c1ccc(cc1)-c1ncccn1)C(F)(F)F)C(=O)NCC#N
:
Substrate
Name:
BDBM19480
Synonyms:
Cbz-Leu-Arg-AMC Z-Leu-Arg-AMC
Type:
Emp. Form.:
Mol. Mass.:
SMILES:
: