Target
Isoform PDE4B2 of cAMP-specific 3',5'-cyclic phosphodiesterase 4B (PDE4B2)
Ligand
BDBM135821
Substrate
Meas. Tech.
Inhibition Assay
IC50
80.0±n/a nM
Citation
 Mjalli, AMGaddam, BPolisetti, DRKostura, MJGuzel, M Tricyclic compounds as modulators of TNF-α synthesis and as PDE4 inhibitors US Patent  US9833457 Publication Date 12/5/2017 
Target
Name:
Isoform PDE4B2 of cAMP-specific 3',5'-cyclic phosphodiesterase 4B (PDE4B2)
Synonyms:
DPDE4 PDE4B2 cAMP-specific 3',5'-cyclic phosphodiesterase 4B (PDE4B2) | phosphodiesterase 4B2
Type:
Enzyme
Mol. Mass.:
64320.36
Organism:
Homo sapiens (Human)
Description:
Q07343-2
Residue:
564
  
Inhibitor
Name:
BDBM135821
Synonyms:
US10085990, Example 118 US8853226, 118 US9833457, 118
Type:
Small organic molecule
Emp. Form.:
C23H21ClN4O5S
Mol. Mass.:
500.955
SMILES:
COc1cccc2c1ncc1c2n([C@H]2CCN(C2)S(C)(=O)=O)c(=O)n(-c2cccc(Cl)c2)c1=O
: