Target
Cathepsin K
Ligand
BDBM19600
Substrate
BDBM19583
Meas. Tech.
Enzyme Inhibition Assay
Ki
4320±n/a nM
Citation
 Alper, PBLiu, HChatterjee, AKNguyen, KTTully, DCTumanut, CLi, JHarris, JLTuntland, TChang, JGordon, PHollenbeck, TKaranewsky, DS Arylaminoethyl amides as noncovalent inhibitors of cathepsin S. Part 2: Optimization of P1 and N-aryl. Bioorg Med Chem Lett 16:1486-90 (2006)  
Target
Name:
Cathepsin K
Synonyms:
CATK_HUMAN CTSO Cathepsin O Cathepsin X
Type:
Enzyme
Mol. Mass.:
36975.68
Organism:
Homo sapiens (Human)
Description:
P43235
Residue:
329
  
Inhibitor
Name:
BDBM19600
Synonyms:
(2S)-N-[(2R,3R)-3-(benzyloxy)-1-(5-fluoro-2,3-dihydro-1H-indol-1-yl)butan-2-yl]-4-cyclohexyl-2-[(3-methoxyphenyl)formamido]butanamide | arylaminoethyl amide, 8h
Type:
Small organic molecule
Emp. Form.:
C37H46FN3O4
Mol. Mass.:
615.7772
SMILES:
COc1cccc(c1)C(=O)N[C@@H](CCC1CCCCC1)C(=O)N[C@H](CN1CCc2cc(F)ccc12)[C@@H](C)OCc1ccccc1
:
Substrate
Name:
BDBM19583
Synonyms:
7-amino-3-carbamoylmethyl-4-methyl coumarin labeled fluorescent peptide | Ac-Lys-His-Pro-Lys-ACMC
Type:
Emp. Form.:
Mol. Mass.:
SMILES:
: