Target
Tyrosine-protein kinase JAK1
Ligand
BDBM362303
Substrate
IC50
55±n/a nM
Citation
 Xu, QSong, YPandey, A Pyridazine compounds as JAK inhibitors US Patent  US9834548 Publication Date 12/5/2017 
Target
Name:
Tyrosine-protein kinase JAK1
Synonyms:
JAK-1 JAK1A JAK1_HUMAN Janus kinase 1 (JAK1) | Janus kinase 1 JAK1
Type:
Protein
Mol. Mass.:
133293.73
Organism:
Homo sapiens (Human)
Description:
P23458
Residue:
1154
  
Inhibitor
Name:
BDBM362303
Synonyms:
US9834548, Example 93
Type:
Small organic molecule
Emp. Form.:
C24H26N8O3S
Mol. Mass.:
506.58
SMILES:
CS(=O)(=O)Cc1ccc(Nc2cc(NC3CCN(CC3)c3ccc(cn3)C#N)c(nn2)C(N)=O)cc1
: