Target
Tyrosine-protein kinase JAK2
Ligand
BDBM362303
Substrate
IC50
55±n/a nM
Citation
 Xu, QSong, YPandey, A Pyridazine compounds as JAK inhibitors US Patent  US9834548 Publication Date 12/5/2017 
Target
Name:
Tyrosine-protein kinase JAK2
Synonyms:
JAK-2 JAK2_HUMAN Janus kinase 2 (JAK2) | Janus kinase 2 (a protein tyrosine kinase)
Type:
Protein
Mol. Mass.:
130684.68
Organism:
Homo sapiens (Human)
Description:
O60674
Residue:
1132
  
Inhibitor
Name:
BDBM362303
Synonyms:
US9834548, Example 93
Type:
Small organic molecule
Emp. Form.:
C24H26N8O3S
Mol. Mass.:
506.58
SMILES:
CS(=O)(=O)Cc1ccc(Nc2cc(NC3CCN(CC3)c3ccc(cn3)C#N)c(nn2)C(N)=O)cc1
: