Target
Tyrosine-protein kinase JAK3
Ligand
BDBM362303
Substrate
IC50
55±n/a nM
Citation
 Xu, QSong, YPandey, A Pyridazine compounds as JAK inhibitors US Patent  US9834548 Publication Date 12/5/2017 
Target
Name:
Tyrosine-protein kinase JAK3
Synonyms:
JAK-3 JAK3_HUMAN Janus kinase 3 (JAK3) L-JAK | Leukocyte janus kinase
Type:
Protein
Mol. Mass.:
125111.08
Organism:
Homo sapiens (Human)
Description:
P52333
Residue:
1124
  
Inhibitor
Name:
BDBM362303
Synonyms:
US9834548, Example 93
Type:
Small organic molecule
Emp. Form.:
C24H26N8O3S
Mol. Mass.:
506.58
SMILES:
CS(=O)(=O)Cc1ccc(Nc2cc(NC3CCN(CC3)c3ccc(cn3)C#N)c(nn2)C(N)=O)cc1
: