Target
Tyrosine-protein kinase ITK/TSK
Ligand
BDBM195837
Substrate
Meas. Tech.
In Vitro Inhibition Assay
IC50
>100±n/a nM
Citation
 Vankayalapati, HYerramreddy, VGangireddy, PAppalaneni, RP Substituted pyrrolo[2,3-b]pyrazines and substituted pyrazolo[3,4-b]pyridines as ITK and JAK kinase inhibitors US Patent  US9834551 Publication Date 12/5/2017 
Target
Name:
Tyrosine-protein kinase ITK/TSK
Synonyms:
EMT ITK_HUMAN LYK Tyrosine-protein kinase ITK Tyrosine-protein kinase Lyk
Type:
Protein
Mol. Mass.:
71839.20
Organism:
Homo sapiens (Human)
Description:
Q08881
Residue:
620
  
Inhibitor
Name:
BDBM195837
Synonyms:
US9206188, 88 | US9834551, Example 88
Type:
Small organic molecule
Emp. Form.:
C17H11ClFN3O
Mol. Mass.:
327.74
SMILES:
CC#CC(=O)Nc1cc(ccc1F)-c1cnc2[nH]cc(Cl)c2c1
: