Target
Tyrosine-protein kinase SYK
Ligand
BDBM243349
Substrate
Meas. Tech.
In Vitro SYK Inhibition Assay
pH
7.8±n/a
Temperature
298.15±n/a K
IC50
<500±n/a nM
Comments
extracted
Citation
 Benjahad, AMartin, JSchalon, CPez, DChevenier, ESandrinelli, FPicoul, WMoussy, A Diazaspiroalkaneone-substituted oxazole derivatives as spleen tyrosine kinase inhibitors US Patent  US10053455 Publication Date 8/21/2018 
Target
Name:
Tyrosine-protein kinase SYK
Synonyms:
KSYK_HUMAN Spleen Tyrosine Kinase Tyrosine-protein kinase SYK (Syk)
Type:
Enzyme
Mol. Mass.:
72079.99
Organism:
Homo sapiens (Human)
Description:
P43405
Residue:
635
  
Inhibitor
Name:
BDBM243349
Synonyms:
4-{5-[3-Methy1-5-(4- trifluoromethyl-pyrimidin- 2-ylamino)-phenyl]- oxazol-2-yl}-4,7-diaza- spiro[2.5]octan-8-one | US10053455, 005
Type:
Small organic molecule
Emp. Form.:
C21H19F3N6O2
Mol. Mass.:
444.4098
SMILES:
Cc1cc(Nc2nccc(n2)C(F)(F)F)cc(c1)-c1cnc(o1)N1CCNC(=O)C11CC1
: