Target
Phosphatidylinositol 3,4,5-trisphosphate 5-phosphatase 2
Ligand
BDBM362865
Substrate
Meas. Tech.
PTP Assay
IC50
1250±60 nM
Citation
 Zhang, ZKontaridis, MZeng, LWang, J SHP2 inhibitors and methods of treating autoimmune and/or glomerulonephritis-associated diseases using SHP2 inhibitors US Patent  US9844535 Publication Date 12/19/2017 
Target
Name:
Phosphatidylinositol 3,4,5-trisphosphate 5-phosphatase 2
Synonyms:
INPPL-1 Inositol polyphosphate phosphatase-like protein 1 Protein 51C SHIP-2 SHIP2_HUMAN | Src homology-2 domain containing protein tyrosine phosphatase-2 (SHP2)
Type:
Enzyme
Mol. Mass.:
138596.65
Organism:
Homo sapiens (Human)
Description:
O15357
Residue:
1258
  
Inhibitor
Name:
BDBM362865
Synonyms:
US9844535, ID 11a-9 (L97M77)
Type:
Small organic molecule
Emp. Form.:
C31H24IN5O5
Mol. Mass.:
673.4572
SMILES:
Cn1c(c(I)c2cc(C(O)=O)c(O)cc12)-c1cccc(NC(=O)C(=O)Nc2ccccc2C2NC3C=CC=CC3=N2)c1
: