Target
Caspase-3
Ligand
BDBM10246
Substrate
Caspase-7 Fluorometric Substrate Ac-Asp-Glu-Val-Asp-AFC
Ki
77±n/a nM
Citation
 Aulabaugh, AKapoor, BHuang, XDollings, PHum, WTBanker, AWood, AEllestad, G Biochemical and biophysical characterization of inhibitor binding to caspase-3 reveals induced asymmetry. Biochemistry 46:9462-71 (2007)  
Target
Name:
Caspase-3
Synonyms:
Apopain CASP3 CPP-32 Caspase 3 Caspase-3 subunit p17 SCA-1 Yama protein | caspase-3 preproprotein
Type:
Hydrolase; heterotetramer of two heterodimers
Mol. Mass.:
31607.55
Organism:
Homo sapiens (Human)
Description:
Residue:
277
  
Inhibitor
Name:
BDBM10246
Synonyms:
(4S)-4-{[(1S)-1-{[(2S)-1-carboxy-3-oxopropan-2-yl]carbamoyl}-2-methylpropyl]carbamoyl}-4-[(3S)-3-acetamido-3-formamidopropanoic acid]butanoic acid CHEMBL417149
Type:
Small organic molecule
Emp. Form.:
C20H30N4O11
Mol. Mass.:
502.4724
SMILES:
CC(C)[C@H](NC(=O)[C@H](CCC(O)=O)NC(=O)[C@H](CC(O)=O)NC(C)=O)C(=O)N[C@@H](CC(O)=O)C=O
:
Substrate
Name:
Caspase-7 Fluorometric Substrate Ac-Asp-Glu-Val-Asp-AFC
Synonyms:
Ac-DEVD-AFC Fluorometric Tetrapeptide Ac-DEVD-AMC
Type:
Peptide
Mol. Mass.:
473.41
Organism:
Description:
Molecular Mass of DEVD
Residue:
4
DEVD