Target
Cathepsin K
Ligand
BDBM19733
Substrate
BDBM19485
Meas. Tech.
Enzyme Inhibition Assay
pH
7±n/a
Temperature
295.15±n/a K
IC50
0.009±n/a nM
Km
35000±n/a nM
Citation
 Altmann, EAichholz, RBetschart, CBuhl, TGreen, JIrie, OTeno, NLattmann, RTintelnot-Blomley, MMissbach, M 2-Cyano-pyrimidines: a new chemotype for inhibitors of the cysteine protease cathepsin K. J Med Chem 50:591-4 (2007)  
Target
Name:
Cathepsin K
Synonyms:
CATK_HUMAN CTSO Cathepsin O Cathepsin X
Type:
Enzyme
Mol. Mass.:
36975.68
Organism:
Homo sapiens (Human)
Description:
P43235
Residue:
329
  
Inhibitor
Name:
BDBM19733
Synonyms:
2-Cyano-pyrimidine, 16c | 2-cyano-4-(cyclohexylamino)-N-[2-(3-methoxyphenyl)ethyl]pyrimidine-5-carboxamide
Type:
Small organic molecule
Emp. Form.:
C21H25N5O2
Mol. Mass.:
379.4555
SMILES:
COc1cccc(CCNC(=O)c2cnc(nc2NC2CCCCC2)C#N)c1
:
Substrate
Name:
BDBM19485
Synonyms:
Cbz-Phe-Arg-AMC Z-Phe-Arg-AMC.HCl
Type:
Emp. Form.:
Mol. Mass.:
SMILES:
: