Target
Cathepsin K
Ligand
BDBM19735
Substrate
BDBM19485
Meas. Tech.
Enzyme Inhibition Assay
pH
7±n/a
Temperature
295.15±n/a K
IC50
0.047±n/a nM
Km
35000±n/a nM
Citation
 Altmann, EAichholz, RBetschart, CBuhl, TGreen, JIrie, OTeno, NLattmann, RTintelnot-Blomley, MMissbach, M 2-Cyano-pyrimidines: a new chemotype for inhibitors of the cysteine protease cathepsin K. J Med Chem 50:591-4 (2007)  
Target
Name:
Cathepsin K
Synonyms:
CATK_HUMAN CTSO Cathepsin O Cathepsin X
Type:
Enzyme
Mol. Mass.:
36975.68
Organism:
Homo sapiens (Human)
Description:
P43235
Residue:
329
  
Inhibitor
Name:
BDBM19735
Synonyms:
2-Cyano-pyrimidine, 16e | 2-cyano-4-(cyclohexylamino)-N-{2-[4-(4-methylpiperazin-1-yl)phenyl]ethyl}pyrimidine-5-carboxamide
Type:
Small organic molecule
Emp. Form.:
C25H33N7O
Mol. Mass.:
447.5758
SMILES:
CN1CCN(CC1)c1ccc(CCNC(=O)c2cnc(nc2NC2CCCCC2)C#N)cc1
:
Substrate
Name:
BDBM19485
Synonyms:
Cbz-Phe-Arg-AMC Z-Phe-Arg-AMC.HCl
Type:
Emp. Form.:
Mol. Mass.:
SMILES:
: