Target
Procathepsin L
Ligand
BDBM19736
Substrate
BDBM19485
Meas. Tech.
Enzyme Inhibition Assay
pH
5.5±n/a
Temperature
295.15±n/a K
IC50
0.34±n/a nM
Km
850±n/a nM
Citation
 Altmann, EAichholz, RBetschart, CBuhl, TGreen, JIrie, OTeno, NLattmann, RTintelnot-Blomley, MMissbach, M 2-Cyano-pyrimidines: a new chemotype for inhibitors of the cysteine protease cathepsin K. J Med Chem 50:591-4 (2007)  
Target
Name:
Procathepsin L
Synonyms:
CATL1_HUMAN CTSL CTSL1 Cathepsin L Cathepsin L1 heavy chain MEP cathepsin L preproprotein
Type:
Enzyme
Mol. Mass.:
37557.19
Organism:
Homo sapiens (Human)
Description:
Purchased from Calbiochem (San Diego, CA).
Residue:
333
  
Inhibitor
Name:
BDBM19736
Synonyms:
2-Cyano-pyrimidine, 17a | 2-cyano-4-[(2,2-dimethylpropyl)amino]-N-[2-(4-methoxyphenyl)ethyl]pyrimidine-5-carboxamide
Type:
Small organic molecule
Emp. Form.:
C20H25N5O2
Mol. Mass.:
367.4448
SMILES:
COc1ccc(CCNC(=O)c2cnc(nc2NCC(C)(C)C)C#N)cc1
:
Substrate
Name:
BDBM19485
Synonyms:
Cbz-Phe-Arg-AMC Z-Phe-Arg-AMC.HCl
Type:
Emp. Form.:
Mol. Mass.:
SMILES:
: