Target
Cathepsin S
Ligand
BDBM19731
Substrate
BDBM19963
Meas. Tech.
Enzyme Inhibition Assay
IC50
0.13±n/a nM
Citation
 Altmann, EAichholz, RBetschart, CBuhl, TGreen, JIrie, OTeno, NLattmann, RTintelnot-Blomley, MMissbach, M 2-Cyano-pyrimidines: a new chemotype for inhibitors of the cysteine protease cathepsin K. J Med Chem 50:591-4 (2007)  
Target
Name:
Cathepsin S
Synonyms:
CATS_HUMAN Cathepsin S (Cat S) | cathepsin S preproprotein
Type:
Protein
Mol. Mass.:
37507.38
Organism:
Homo sapiens (Human)
Description:
P25774
Residue:
331
  
Inhibitor
Name:
BDBM19731
Synonyms:
2-Cyano-pyrimidine, 16a CHEMBL386506
Type:
Small organic molecule
Emp. Form.:
C20H23N5O
Mol. Mass.:
349.4295
SMILES:
O=C(NCCc1ccccc1)c1cnc(nc1NC1CCCCC1)C#N
:
Substrate
Name:
BDBM19963
Synonyms:
Cbz-Leu-Leu-Arg-AMC Z-Leu-Leu-Arg-AMC
Type:
Emp. Form.:
Mol. Mass.:
SMILES:
: