Target
Cathepsin S
Ligand
BDBM19732
Substrate
BDBM19963
Meas. Tech.
Enzyme Inhibition Assay
IC50
0.7±n/a nM
Citation
 Altmann, EAichholz, RBetschart, CBuhl, TGreen, JIrie, OTeno, NLattmann, RTintelnot-Blomley, MMissbach, M 2-Cyano-pyrimidines: a new chemotype for inhibitors of the cysteine protease cathepsin K. J Med Chem 50:591-4 (2007)  
Target
Name:
Cathepsin S
Synonyms:
CATS_HUMAN Cathepsin S (Cat S) | cathepsin S preproprotein
Type:
Protein
Mol. Mass.:
37507.38
Organism:
Homo sapiens (Human)
Description:
P25774
Residue:
331
  
Inhibitor
Name:
BDBM19732
Synonyms:
2-Cyano-pyrimidine, 16b | 2-cyano-4-(cyclohexylamino)-N-[2-(4-methoxyphenyl)ethyl]pyrimidine-5-carboxamide
Type:
Small organic molecule
Emp. Form.:
C21H25N5O2
Mol. Mass.:
379.4555
SMILES:
COc1ccc(CCNC(=O)c2cnc(nc2NC2CCCCC2)C#N)cc1
:
Substrate
Name:
BDBM19963
Synonyms:
Cbz-Leu-Leu-Arg-AMC Z-Leu-Leu-Arg-AMC
Type:
Emp. Form.:
Mol. Mass.:
SMILES:
: