Target
Apelin receptor
Ligand
BDBM270138
Substrate
Meas. Tech.
[35S]GTPγS Binding
EC50
0.180±n/a nM
Citation
 Chen, NChen, XCheng, ACConnors, RVDeignan, JDransfield, PJDu, XFu, ZHeath, JAHorne, DBHouze, JKaller, MRKopecky, DJLai, SMa, ZMcGee, LRMedina, JCMihalic, JTNishimura, NOlson, SHPattaropong, VWang, XYang, KDebenedetto, MVHedley, SJ Intermediates for preparing triazole agonists of the APJ receptor US Patent  US9845310 Publication Date 12/19/2017 
Target
Name:
Apelin receptor
Synonyms:
AGTRL1 APJ_HUMAN Angiotensin receptor-like 1 Apelin receptor (APJ) G-protein coupled receptor HG11
Type:
Enzyme Catalytic Domain
Mol. Mass.:
42664.06
Organism:
Homo sapiens (Human)
Description:
P35414
Residue:
380
  
Inhibitor
Name:
BDBM270138
Synonyms:
(2R,3S)-N-(4-(2,6-dimethoxyphenyl)-5-(6-methoxy-2-pyridinyl)-4H-1,2,4-triazol-3-yl)-3-(5-methoxy-2-pyrazinyl)-2-butanesulfonamide, (2S,3R)-N-(4-(2,6-dimethoxyphenyl)-5-(6-methoxy-2-pyridinyl)-4H-1,2,4-triazol-3-yl)-3-(5-methoxy-2-pyrazinyl)-2-butanesulfonamide US10058550, Example 708.0 US9845310, Example 708.0
Type:
Small organic molecule
Emp. Form.:
C25H29N7O6S
Mol. Mass.:
555.606
SMILES:
COc1cccc(n1)-c1nnc(NS(=O)(=O)[C@H](C)[C@@H](C)c2cnc(OC)cn2)n1-c1c(OC)cccc1OC
: