Target
Cathepsin S
Ligand
BDBM19783
Substrate
BDBM19490
Meas. Tech.
Enzyme Inhibition Assay
IC50
0.21±n/a nM
Citation
 Barrett, DGCatalano, JGDeaton, DNLong, STMcFadyen, RBMiller, ABMiller, LRSamano, VTavares, FXWells-Knecht, KJWright, LLZhou, HQ Acyclic, orally bioavailable ketone-based cathepsin K inhibitors. Bioorg Med Chem Lett 17:22-7 (2007)  
Target
Name:
Cathepsin S
Synonyms:
CATS_HUMAN Cathepsin S (Cat S) | cathepsin S preproprotein
Type:
Protein
Mol. Mass.:
37507.38
Organism:
Homo sapiens (Human)
Description:
P25774
Residue:
331
  
Inhibitor
Name:
BDBM19783
Synonyms:
(2S)-3,3-dimethyl-1-{3-[4-(trifluoromethyl)phenyl]-1H-pyrazol-1-yl}butan-2-yl N-[(2S)-1-oxo-1-(1H-pyrazol-5-ylcarbamoyl)hexan-2-yl]carbamate ketoamide, 2
Type:
Small organic molecule
Emp. Form.:
C27H33F3N6O4
Mol. Mass.:
562.5839
SMILES:
CCCC[C@H](NC(=O)O[C@H](Cn1ccc(n1)-c1ccc(cc1)C(F)(F)F)C(C)(C)C)C(=O)C(=O)Nc1ccn[nH]1
:
Substrate
Name:
BDBM19490
Synonyms:
Cbz-Val-Val-Arg-AMC Z-Val-Val-Arg-AMC
Type:
Emp. Form.:
Mol. Mass.:
SMILES:
: