Target
P2X purinoceptor 3
Ligand
BDBM244381
Substrate
Meas. Tech.
Receptor Inhibition Assay
pH
7.5±n/a
IC50
1.000±n/a nM
Comments
extracted
Citation
 Kai, HTanaka, SHiramatsu, YNozu, ANakamura, K Heterocyclic ring and carbocyclic derivative US Patent  US9550763 Publication Date 1/24/2017 
Target
Name:
P2X purinoceptor 3
Synonyms:
ATP receptor P2RX3 P2X purinoceptor 3 P2X purinoceptor 3 (P2X3) P2X3 purinoceptor p2x3 + hsa
Type:
Protein
Mol. Mass.:
44292.02
Organism:
Homo sapiens (Human)
Description:
P56373
Residue:
397
  
Inhibitor
Name:
BDBM244381
Synonyms:
US9550763, Compound I-133
Type:
Small organic molecule
Emp. Form.:
C28H25ClFN5O4
Mol. Mass.:
549.981
SMILES:
Fc1ccc(Oc2ccc(Nc3ncc(NC(=O)C4CCOCC4)c(=O)n3Cc3ccc(Cl)cc3)cc2)nc1
: