Target
Isocitrate dehydrogenase [NADP] cytoplasmic [R132H]
Ligand
BDBM363523
Substrate
Meas. Tech.
In Vitro Assay
IC50
<500±n/a nM
Citation
 Popovici-Muller, JLemieux, RMTravins, JCai, ZCui, DZhou, D Therapeutically active compositions and their methods of use US Patent  US9850277 Publication Date 12/26/2017 
Target
Name:
Isocitrate dehydrogenase [NADP] cytoplasmic [R132H]
Synonyms:
Cytosolic NADP-isocitrate dehydrogenase (IDH1)(R132H) IDH1 R132H IDHC_HUMAN Isocitrate dehydrogenase 1 mutant (R132H) Isocitrate dehydrogenase [NADP] cytoplasmic (IDH1)(R132H) PICD
Type:
Protein
Mol. Mass.:
46641.74
Organism:
Homo sapiens (Human)
Description:
Human IDH1 R132H (SEQ ID No. 2 in patent). First three are removed. Google patent parsed wrong.
Residue:
414
  
Inhibitor
Name:
BDBM363523
Synonyms:
US10640534, Compound 15 US10717764, Compound 15 US11667673, Compound 15 | US9850277, Compound 15
Type:
Small organic molecule
Emp. Form.:
C29H26ClF3N4O3
Mol. Mass.:
570.99
SMILES:
Cc1cccnc1N1[C@@H](CCC1=O)C(=O)N([C@H](C(=O)NC1CC(F)(F)C1)c1ccccc1Cl)c1cccc(F)c1
: