Target
Estrogen receptor
Ligand
BDBM19972
Substrate
17beta-estradiol (E2)
Meas. Tech.
Estrogen Receptor Binding Assay.
pH
7.5±n/a
Temperature
295.15±n/a K
Ki
2.88±2.9 nM
Citation
 Richardson, TINorman, BHLugar, CWJones, SAWang, YDurbin, JDKrishnan, VDodge, JA Benzopyrans as selective estrogen receptor beta agonists (SERBAs). Part 2: structure-activity relationship studies on the benzopyran scaffold. Bioorg Med Chem Lett 17:3570-4 (2007)  
Target
Name:
Estrogen receptor
Synonyms:
ER ESR ESR1_HUMAN Estrogen receptor Estrogen receptor (ER-alpha) Estrogen receptor alpha (ER) Nuclear receptor subfamily 3 group A member 1
Type:
Protein
Mol. Mass.:
66230.44
Organism:
Homo sapiens (Human)
Description:
P03372
Residue:
595
  
Inhibitor
Name:
BDBM19972
Synonyms:
(1R,9R,10S)-9-(4-hydroxyphenyl)-8-oxatricyclo[8.4.0.0^{2,7}]tetradeca-2(7),3,5-trien-4-ol racemic mixture
Type:
Small organic molecule
Emp. Form.:
C19H20O3
Mol. Mass.:
296.3603
SMILES:
Oc1ccc(cc1)[C@@H]1Oc2ccc(O)cc2[C@@H]2CCCC[C@H]12
:
Substrate
Name:
BDBM17292
Synonyms:
(1S,10R,11S,14S,15S)-15-methyltetracyclo[8.7.0.0^{2,7}.0^{11,15}]heptadeca-2,4,6-triene-5,14-diol 17α-ethinylestradiol CHEMBL135 ESTRADIOL Ovocyclin US9040509, E2 US9561238, E2 [2,4,6,7-3H]-E2 [3H]]estradiol
Type:
Steroid
Emp. Form.:
C18H24O2
Mol. Mass.:
272.382
SMILES:
[H][C@@]12CC[C@H](O)[C@@]1(C)CC[C@]1([H])c3ccc(O)cc3CC[C@@]21[H]
: