Target
Oxysterols receptor LXR-alpha [197-447]
Ligand
BDBM20001
Substrate
BDBM19993
Meas. Tech.
LXR Binding Assay
pH
7.4±n/a
Temperature
277.15±n/a K
IC50
7.6±0.8 nM
Citation
 Hu, BCollini, MUnwalla, RMiller, CSinghaus, RQuinet, ESavio, DHalpern, ABasso, MKeith, JClerin, VChen, LResmini, CLiu, QYFeingold, IHuselton, CAzam, FFarnegardh, MEnroth, CBonn, TGoos-Nilsson, AWilhelmsson, ANambi, PWrobel, J Discovery of phenyl acetic acid substituted quinolines as novel liver X receptor agonists for the treatment of atherosclerosis. J Med Chem 49:6151-4 (2006)  
Target
Name:
Oxysterols receptor LXR-alpha [197-447]
Synonyms:
LXRA NR1H3 Nuclear orphan receptor LXR-alpha Oxysterols receptor LXR-alpha
Type:
Receptor
Mol. Mass.:
28986.41
Organism:
Homo sapiens (Human)
Description:
LXR alpha ligand binding domain (amino acid residues 197-447) with an N-terminal biotinylation tag expressed in E.coli, was used for the binding assays.
Residue:
251
  
Inhibitor
Name:
BDBM20001
Synonyms:
2-{4-[({3-[3-benzyl-8-(trifluoromethyl)quinolin-4-yl]phenyl}amino)methyl]phenyl}acetic acid JMC517161 Compound 4 | Quinoline 16
Type:
Small organic molecule
Emp. Form.:
C32H25F3N2O2
Mol. Mass.:
526.5483
SMILES:
OC(=O)Cc1ccc(CNc2cccc(c2)-c2c(Cc3ccccc3)cnc3c(cccc23)C(F)(F)F)cc1
:
Substrate
Name:
BDBM19993
Synonyms:
CHEMBL62136 T 0901317 TO-901317 US10669296, Compound TO901317 [3H]T0901317
Type:
Small organic molecule
Emp. Form.:
C17H12F9NO3S
Mol. Mass.:
481.333
SMILES:
OC(c1ccc(cc1)N(CC(F)(F)F)S(=O)(=O)c1ccccc1)(C(F)(F)F)C(F)(F)F
: