Target
Oxysterols receptor LXR-alpha [197-447]
Ligand
BDBM20011
Substrate
BDBM19993
Meas. Tech.
LXR Binding Assay
pH
7.4±n/a
Temperature
277.15±n/a K
IC50
21±n/a nM
Citation
 Hu, BJetter, JKaufman, DSinghaus, RBernotas, RUnwalla, RQuinet, ESavio, DHalpern, ABasso, MKeith, JClerin, VChen, LLiu, QYFeingold, IHuselton, CAzam, FGoos-Nilsson, AWilhelmsson, ANambi, PWrobel, J Further modification on phenyl acetic acid based quinolines as liver X receptor modulators. Bioorg Med Chem 15:3321-33 (2007)  
Target
Name:
Oxysterols receptor LXR-alpha [197-447]
Synonyms:
LXRA NR1H3 Nuclear orphan receptor LXR-alpha Oxysterols receptor LXR-alpha
Type:
Receptor
Mol. Mass.:
28986.41
Organism:
Homo sapiens (Human)
Description:
LXR alpha ligand binding domain (amino acid residues 197-447) with an N-terminal biotinylation tag expressed in E.coli, was used for the binding assays.
Residue:
251
  
Inhibitor
Name:
BDBM20011
Synonyms:
2-[4-({[3-(3-benzyl-8-methylquinolin-4-yl)phenyl]amino}methyl)phenyl]acetic acid | phenyl acetic acid based quinoline, 23
Type:
Small organic molecule
Emp. Form.:
C32H28N2O2
Mol. Mass.:
472.5769
SMILES:
Cc1cccc2c(c(Cc3ccccc3)cnc12)-c1cccc(NCc2ccc(CC(O)=O)cc2)c1
:
Substrate
Name:
BDBM19993
Synonyms:
CHEMBL62136 T 0901317 TO-901317 US10669296, Compound TO901317 [3H]T0901317
Type:
Small organic molecule
Emp. Form.:
C17H12F9NO3S
Mol. Mass.:
481.333
SMILES:
OC(c1ccc(cc1)N(CC(F)(F)F)S(=O)(=O)c1ccccc1)(C(F)(F)F)C(F)(F)F
: