Target
Oxysterols receptor LXR-alpha
Ligand
BDBM20166
Substrate
biotinylated SRC-1 peptide
Meas. Tech.
Cell-Free Ligand Sensing Assay (LiSA)-LXRalpha-SRC1 Assay
pH
7.5±n/a
Temperature
295.15±n/a K
EC50
260±10 nM
Comments
The relative efficacy (RE) compared to 24(S),25-epoxycholesterol is 0.8 in LXRalpha-SRC1 assay. Inactive in LXRalpha-GAL4 expression @ 10 uM.
Citation
 Collins, JLFivush, AMWatson, MAGalardi, CMLewis, MCMoore, LBParks, DJWilson, JGTippin, TKBinz, JGPlunket, KDMorgan, DGBeaudet, EJWhitney, KDKliewer, SAWillson, TM Identification of a nonsteroidal liver X receptor agonist through parallel array synthesis of tertiary amines. J Med Chem 45:1963-6 (2002)  
Target
Name:
Oxysterols receptor LXR-alpha
Synonyms:
LXRA Liver X receptor alpha Liver X receptor alpha (NR1H3) NR1H3 Nuclear orphan receptor LXR-alpha | Nuclear receptor subfamily 1 group H member 3
Type:
Enzyme Catalytic Domain
Mol. Mass.:
50403.85
Organism:
Homo sapiens (Human)
Description:
Q13133
Residue:
447
  
Inhibitor
Name:
BDBM20166
Synonyms:
2-(3-{3-[(2,2-diphenylethyl)[(4-methoxyphenyl)methyl]amino]propoxy}phenyl)acetamide | Tertiary amine, 4
Type:
Small organic molecule
Emp. Form.:
C33H36N2O3
Mol. Mass.:
508.6505
SMILES:
COc1ccc(CN(CCCOc2cccc(CC(N)=O)c2)CC(c2ccccc2)c2ccccc2)cc1
:
Substrate
Name:
biotinylated SRC-1 peptide
Synonyms:
Type:
Peptide
Mol. Mass.:
3157.52
Organism:
Description:
A biotinylated peptide comprises amino acids 675-699 of steroid receptor coactivator 1 (SRC1).
Residue:
28