Target
Signal transducer and activator of transcription 3
Ligand
BDBM20241
Substrate
BDBM20194
Meas. Tech.
Fluorescence Polarization Assay
IC50
1220±n/a nM
Citation
 Coleman, DRRen, ZMandal, PKCameron, AGDyer, GAMuranjan, SCampbell, MChen, XMcMurray, JS Investigation of the binding determinants of phosphopeptides targeted to the SRC homology 2 domain of the signal transducer and activator of transcription 3. Development of a high-affinity peptide inhibitor. J Med Chem 48:6661-70 (2005)  
Target
Name:
Signal transducer and activator of transcription 3
Synonyms:
Acute-phase response factor STAT3 alpha Signal transducer and activator of transcription 3 Transcription Factor STAT3
Type:
Cytosolic Transcription Factor
Mol. Mass.:
88050.28
Organism:
Mus musculus (mouse)
Description:
Bacterially expressed protein was used in the FP assay.
Residue:
770
  
Inhibitor
Name:
BDBM20241
Synonyms:
4-[(2S)-2-{[(2S)-1-[(2S)-2-{[(1S)-3-carbamoyl-1-{[(1S,2S)-1-carbamoyl-2-hydroxypropyl](methyl)carbamoyl}propyl]carbamoyl}pyrrolidin-1-yl]-4-methyl-1-oxopentan-2-yl]carbamoyl}-2-acetamidoethyl]phenoxyphosphonic acid | 48, Ac-pTyr-Leu-Pro-Gln-N-MeThr-NH2
Type:
Phosphopeptide
Emp. Form.:
C32H50N7O12P
Mol. Mass.:
755.7529
SMILES:
CC(C)C[C@H](NC(=O)[C@H](Cc1ccc(OP(O)(O)=O)cc1)NC(C)=O)C(=O)N1CCC[C@H]1C(=O)N[C@@H](CCC(N)=O)C(=O)N(C)[C@@H](C(C)O)C(N)=O
:
Substrate
Name:
BDBM20194
Synonyms:
5-carboxyfluoresceinyl-Ala-Tyr(PO3H2)-Leu-Pro-Gln-Thr-Val-NH2 Ala-Tyr(PO3H2)-Leu-Pro-Gln-Thr-Val-NH2
Type:
Fluorescent Peptide
Emp. Form.:
C58H70N9O19P
Mol. Mass.:
1228.1991
SMILES:
CC(C)C[C@H](NC(=O)[C@H](Cc1ccc(OP(O)(O)=O)cc1)NC(=O)[C@H](C)NC(=O)c1ccc(c(c1)C(O)=O)-c1c2ccc(O)cc2oc2cc(=O)ccc12)C(=O)N1CCC[C@H]1C(=O)N[C@@H](CCC(N)=O)C(=O)N[C@@H](C(C)O)C(=O)N[C@@H](C(C)C)C(N)=O
: