Target
Signal transducer and activator of transcription 3
Ligand
BDBM20253
Substrate
c-fos sis inducible element (hSIE)
Meas. Tech.
Electrophoretic Mobility Shift Assay (EMSA)
pH
7.8±n/a
Temperature
295.15±n/a K
IC50
400±n/a nM
Citation
 Ren, ZCabell, LASchaefer, TSMcMurray, JS Identification of a high-affinity phosphopeptide inhibitor of Stat3. Bioorg Med Chem Lett 13:633-6 (2003)  
Target
Name:
Signal transducer and activator of transcription 3
Synonyms:
Acute-phase response factor STAT3 alpha Signal transducer and activator of transcription 3 Transcription Factor STAT3
Type:
Cytosolic Transcription Factor
Mol. Mass.:
88050.28
Organism:
Mus musculus (mouse)
Description:
Bacterially expressed protein was used in the FP assay.
Residue:
770
  
Inhibitor
Name:
BDBM20253
Synonyms:
LIFR (1001) derived peptide, 9 | Y(p)KPQMH
Type:
Phosphopeptide
Emp. Form.:
C38H58N11O12PS
Mol. Mass.:
923.972
SMILES:
CSCC[C@H](NC(=O)[C@H](CCC(N)=O)NC(=O)[C@@H]1CCCN1C(=O)[C@H](CCCCN)NC(=O)[C@H](Cc1ccc(OP(O)(O)=O)cc1)NC(C)=O)C(=O)N[C@@H](Cc1cnc[nH]1)C(N)=O
:
Substrate
Name:
c-fos sis inducible element (hSIE)
Synonyms:
32P-labeled c-fos sis inducible element (hSIE)
Type:
Oligonucleotide
Mol. Mass.:
2192.56
Organism:
Description:
hSIE derived from the c-fos gene promoter.
Residue:
24