Target
P2X purinoceptor 7
Ligand
BDBM246862
Substrate
Meas. Tech.
P2X7 Radioligand Binding
Ki
1.40±n/a nM
Citation
 Ameriks, MKRech, JCSavall, BMWall, JL Substituted [1,2,4]triazolo[4,3-a]pyrazines as P2X7 modulators US Patent  US10053463 Publication Date 8/21/2018 
Target
Name:
P2X purinoceptor 7
Synonyms:
ATP receptor P2RX7_HUMAN P2X purinoceptor 7 (P2X7) P2Z receptor | Purinergic receptor
Type:
Protein
Mol. Mass.:
68602.85
Organism:
Homo sapiens (Human)
Description:
Q99572
Residue:
595
  
Inhibitor
Name:
BDBM246862
Synonyms:
6-methylpicolinohydrazide | US10053463, 13
Type:
Small organic molecule
Emp. Form.:
C7H9N3O
Mol. Mass.:
151.1659
SMILES:
Cc1cccc(n1)C(=O)NN
: