Target
P2X purinoceptor 7
Ligand
BDBM160091
Substrate
Meas. Tech.
P2X7 Radioligand Binding
Ki
0.400±n/a nM
Citation
 Ameriks, MKRech, JCSavall, BMWall, JL Substituted [1,2,4]triazolo[4,3-a]pyrazines as P2X7 modulators US Patent  US10053463 Publication Date 8/21/2018 
Target
Name:
P2X purinoceptor 7
Synonyms:
P2RX7_MOUSE P2x7
Type:
PROTEIN
Mol. Mass.:
68405.16
Organism:
Mus musculus
Description:
ChEMBL_1473824
Residue:
595
  
Inhibitor
Name:
BDBM160091
Synonyms:
US10047092, 32 US9040534, 32
Type:
Small organic molecule
Emp. Form.:
C17H13ClF3N5OS
Mol. Mass.:
427.831
SMILES:
C[C@H]1Cn2c(nnc2C(=O)N1Cc1cccc(c1Cl)C(F)(F)F)-c1cscn1
: