Target
P2X purinoceptor 4
Ligand
BDBM366077
Substrate
Meas. Tech.
Inhibition Activity Assay
IC50
78.0±n/a nM
Citation
 Sakuma, SKobayashi, KUshioda, MSaito, DImai, TInoue, K P2X4 receptor antagonist US Patent  US9873683 Publication Date 1/23/2018 
Target
Name:
P2X purinoceptor 4
Synonyms:
ATP receptor P2RX4_HUMAN Purinergic receptor | Purinergic, P2X4
Type:
Enzyme Catalytic Domain
Mol. Mass.:
43374.70
Organism:
Homo sapiens (Human)
Description:
Purinergic, P2X4 0 HUMAN::Q99571
Residue:
388
  
Inhibitor
Name:
BDBM366077
Synonyms:
5-[4-(2-Phenethyl-1H-imidazol-1-yl)phenyl]-1H-naphtho[1,2-b][1,4]diazepine-2,4(3H,5H)-dione | US9873683, Example 21
Type:
Small organic molecule
Emp. Form.:
C30H24N4O2
Mol. Mass.:
472.5372
SMILES:
O=C1CC(=O)N(c2ccc(cc2)-n2ccnc2CCc2ccccc2)c2ccc3ccccc3c2N1
: