Target
P2X purinoceptor 4
Ligand
BDBM366069
Substrate
Meas. Tech.
Inhibition Activity Assay
IC50
39.0±n/a nM
Citation
 Sakuma, SKobayashi, KUshioda, MSaito, DImai, TInoue, K P2X4 receptor antagonist US Patent  US9873683 Publication Date 1/23/2018 
Target
Name:
P2X purinoceptor 4
Synonyms:
ATP receptor P2RX4_HUMAN Purinergic receptor | Purinergic, P2X4
Type:
Enzyme Catalytic Domain
Mol. Mass.:
43374.70
Organism:
Homo sapiens (Human)
Description:
Purinergic, P2X4 0 HUMAN::Q99571
Residue:
388
  
Inhibitor
Name:
BDBM366069
Synonyms:
US9873683, Example 79
Type:
Small organic molecule
Emp. Form.:
C29H25FN4O2
Mol. Mass.:
480.5328
SMILES:
Fc1cccc(CCc2nccn2-c2ccc(cc2)N2c3ccc4CCCc4c3NC(=O)CC2=O)c1
: