Target
P2X purinoceptor 4
Ligand
BDBM366071
Substrate
Meas. Tech.
Inhibition Activity Assay
IC50
87.0±n/a nM
Citation
 Sakuma, SKobayashi, KUshioda, MSaito, DImai, TInoue, K P2X4 receptor antagonist US Patent  US9873683 Publication Date 1/23/2018 
Target
Name:
P2X purinoceptor 4
Synonyms:
ATP receptor P2RX4_HUMAN Purinergic receptor | Purinergic, P2X4
Type:
Enzyme Catalytic Domain
Mol. Mass.:
43374.70
Organism:
Homo sapiens (Human)
Description:
Purinergic, P2X4 0 HUMAN::Q99571
Residue:
388
  
Inhibitor
Name:
BDBM366071
Synonyms:
US9873683, Example 83
Type:
Small organic molecule
Emp. Form.:
C31H25FN4O3
Mol. Mass.:
520.5536
SMILES:
COc1c(F)cccc1CCc1nccn1-c1ccc(cc1)N1c2ccc3ccccc3c2NC(=O)CC1=O
: