Target
Dimer of Gag-Pol polyprotein [489-587]
Ligand
BDBM198
Substrate
HIV Protease Chromogenic Peptide Substrate
Meas. Tech.
Protease Inhibition Assay
pH
4.7±n/a
Temperature
310.15±n/a K
Ki
1.3±0.2 nM
Citation
 Clemente, JCRobbins, AGraña, PPaleo, MRCorrea, JFVillaverde, MCSardina, FJGovindasamy, LAgbandje-McKenna, MMcKenna, RDunn, BMSussman, F Design, Synthesis, Evaluation, and Crystallographic-Based Structural Studies of HIV-1 Protease Inhibitors with Reduced Response to the V82A Mutation. J Med Chem 51:852-60 (2008)  
Target
Name:
Dimer of Gag-Pol polyprotein [489-587]
Synonyms:
HIV-1 Protease | HIV-1 protease LAI variant
Type:
Protein Complex
Mol. Mass.:
Description:
The HIV-1 PR DNA for HIV LAI variant was cloned, and protein was expressed, purified, and refolded from Escherichia coli strain BL21.
Components:
This complex has 2 components.
Component 1
Name:
Gag-Pol polyprotein [489-587]
Synonyms:
Human immunodeficiency virus type 1 protease Pol polyprotein | gag-pol
Type:
Enzyme Subunit
Mol. Mass.:
10781.16
Organism:
Human immunodeficiency virus type 1
Description:
P04585[489-587]
Residue:
99
  
Component 2
Name:
Gag-Pol polyprotein [489-587]
Synonyms:
Human immunodeficiency virus type 1 protease Pol polyprotein | gag-pol
Type:
Enzyme Subunit
Mol. Mass.:
10781.16
Organism:
Human immunodeficiency virus type 1
Description:
P04585[489-587]
Residue:
99
  
Inhibitor
Name:
BDBM198
Synonyms:
(2S)-N-[(2S,3S,4S,5S)-3,4-dihydroxy-5-[(2S)-3-methyl-2-{[methyl(pyridin-2-ylmethyl)carbamoyl]amino}butanamido]-1,6-diphenylhexan-2-yl]-3-methyl-2-{[methyl(pyridin-2-ylmethyl)carbamoyl]amino}butanamide JMC51852 Inhibitor PP
Type:
Emp. Form.:
C44H58N8O6
Mol. Mass.:
794.9813
SMILES:
CC(C)[C@H](NC(=O)N(C)Cc1ccccn1)C(=O)N[C@@H](Cc1ccccc1)[C@H](O)[C@@H](O)[C@H](Cc1ccccc1)NC(=O)[C@@H](NC(=O)N(C)Cc1ccccn1)C(C)C
:
Substrate
Name:
HIV Protease Chromogenic Peptide Substrate
Synonyms:
Type:
Peptide
Mol. Mass.:
1420.11
Organism:
Description:
Residue:
13
KARVLNPHEANLG