Target
Genome polyprotein
Ligand
BDBM244612
Substrate
Meas. Tech.
Antiviral Activity
EC50
120±n/a nM
Citation
 Heuer, TSOslob, JDMcDowell, RSJohnson, RYang, HEvanchik, MZaharia, CACai, HHu, LWDuke, GOhol-Gupta, YO Farrell, M Heterocyclic modulators of lipid synthesis and combinations thereof US Patent  US10226449 Publication Date 3/12/2019 
Target
Name:
Genome polyprotein
Synonyms:
HCV Polymerase (S282T) NS3/4A Protein POLG_HCVJA
Type:
Protein
Mol. Mass.:
327076.78
Organism:
Hepatitis C Virus (Virus)
Description:
P26662
Residue:
3010
  
Inhibitor
Name:
BDBM244612
Synonyms:
US10226449, cpd 221 | US9428502, 221
Type:
Small organic molecule
Emp. Form.:
C23H19N5O2
Mol. Mass.:
397.4293
SMILES:
Cc1ccc(cc1-c1[nH]c(CO)nc1C#N)C(=O)N1CC(C1)c1ccc(cc1)C#N
: