Target
Hemagglutinin
Ligand
BDBM247017
Substrate
Meas. Tech.
Endonuclease Assay
pH
7.5±n/a
IC50
3300±n/a nM
Comments
extracted
Citation
 Lavoie, EJBauman, JDSagong, HYArnold, EParhi, ADas, KVijayan, SKPatel, D Therapeutic hydroxyquinolones US Patent  US9701638 Publication Date 7/11/2017 
Target
Name:
Hemagglutinin
Synonyms:
HA | Hemagglutinin HA1 chain
Type:
Enzyme Catalytic Domain
Mol. Mass.:
63281.44
Organism:
Influenza A virus (strain swl A/California/04/2009 H1N1)
Description:
C3W5S1
Residue:
566
  
Inhibitor
Name:
BDBM247017
Synonyms:
US9701638, 8
Type:
Small organic molecule
Emp. Form.:
C17H16FNO2
Mol. Mass.:
285.3128
SMILES:
CC.Oc1cc2c(cccc2[nH]c1=O)-c1ccc(F)cc1
: