Target
Adenosine receptor A2a
Ligand
BDBM21199
Substrate
BDBM21190
Meas. Tech.
Receptor Binding Assay
pH
7.4±n/a
Temperature
295.15±n/a K
Ki
6±2 nM
Citation
 Slee, DHMoorjani, MZhang, XLin, ELanier, MCChen, YRueter, JKLechner, SMMarkison, SMalany, SJoswig, TSantos, MGross, RSWilliams, JPCastro-Palomino, JCCrespo, MIPrat, MGual, SDíaz, JLJalali, KSai, YZuo, ZYang, CWen, JO'Brien, ZPetroski, RSaunders, J 2-Amino-N-pyrimidin-4-ylacetamides as A2A Receptor Antagonists: 2. Reduction of hERG Activity, Observed Species Selectivity, and Structure-Activity Relationships. J Med Chem 51:1730-9 (2008)  
Target
Name:
Adenosine receptor A2a
Synonyms:
A2A adenosine receptor (hA2A) ADENOSINE A2 ADORA2 Adenosine A2A receptor (A2AAR)
Type:
G Protein-Coupled Receptor (GPCR)
Mol. Mass.:
44716.46
Organism:
Homo sapiens (Human)
Description:
P29274
Residue:
412
  
Inhibitor
Name:
BDBM21199
Synonyms:
N-[6-(3,5-dimethyl-1H-pyrazol-1-yl)-2-(5-methylfuran-2-yl)pyrimidin-4-yl]-2-(1,4-oxazepan-4-yl)acetamide | Pyrimidin-4-ylacetamide, 10
Type:
Small organic molecule
Emp. Form.:
C21H26N6O3
Mol. Mass.:
410.4695
SMILES:
Cc1cc(C)n(n1)-c1cc(NC(=O)CN2CCCOCC2)nc(n1)-c1ccc(C)o1
:
Substrate
Name:
BDBM21190
Synonyms:
4-(2-{[5-amino-2-(furan-2-yl)-[1,2,4]triazolo[1,5-a][1,3,5]triazin-7-yl]amino}ethyl)phenol ZM 241385 [3H]-ZM241385
Type:
Small organic molecule
Emp. Form.:
C16H15N7O2
Mol. Mass.:
337.336
SMILES:
Nc1nc(NCCc2ccc(O)cc2)nc2nc(nn12)-c1ccco1
: