Target
Adenosine receptor A1
Ligand
BDBM21199
Substrate
BDBM21173
Meas. Tech.
Receptor Binding Assay
Ki
630±n/a nM
Citation
 Slee, DHMoorjani, MZhang, XLin, ELanier, MCChen, YRueter, JKLechner, SMMarkison, SMalany, SJoswig, TSantos, MGross, RSWilliams, JPCastro-Palomino, JCCrespo, MIPrat, MGual, SDíaz, JLJalali, KSai, YZuo, ZYang, CWen, JO'Brien, ZPetroski, RSaunders, J 2-Amino-N-pyrimidin-4-ylacetamides as A2A Receptor Antagonists: 2. Reduction of hERG Activity, Observed Species Selectivity, and Structure-Activity Relationships. J Med Chem 51:1730-9 (2008)  
Target
Name:
Adenosine receptor A1
Synonyms:
A1 adenosine receptor (hA1) AA1R_HUMAN ADORA1 Adenosine A1-receptor Adenosine receptor A1 (hA1) | Adenosine transporter (AdT)
Type:
G Protein-Coupled Receptor (GPCR)
Mol. Mass.:
36520.92
Organism:
Homo sapiens (Human)
Description:
P30542
Residue:
326
  
Inhibitor
Name:
BDBM21199
Synonyms:
N-[6-(3,5-dimethyl-1H-pyrazol-1-yl)-2-(5-methylfuran-2-yl)pyrimidin-4-yl]-2-(1,4-oxazepan-4-yl)acetamide | Pyrimidin-4-ylacetamide, 10
Type:
Small organic molecule
Emp. Form.:
C21H26N6O3
Mol. Mass.:
410.4695
SMILES:
Cc1cc(C)n(n1)-c1cc(NC(=O)CN2CCCOCC2)nc(n1)-c1ccc(C)o1
:
Substrate
Name:
BDBM21173
Synonyms:
1,3-dipropyl-8-cyclopentylxanthine CHEMBL183 PD116948 | [3H]DPCPX
Type:
radiolabeled ligand
Emp. Form.:
C16H24N4O2
Mol. Mass.:
304.3874
SMILES:
CCCn1c2nc([nH]c2c(=O)n(CCC)c1=O)C1CCCC1
: