Target
Mast/stem cell growth factor receptor Kit
Ligand
BDBM369363
Substrate
Meas. Tech.
Cell-Based Assays of c-Kit Mutant Kinase Activity
Ki
5500±n/a nM
Citation
 Lin, JBuell, JChan, KEwing, TIbrahim, PNespi, MPham, PShi, SSpevak, WWu, GZhang, JZhang, Y Compounds and methods for kinase modulation, and indications therefor US Patent  US10227357 Publication Date 3/12/2019 
Target
Name:
Mast/stem cell growth factor receptor Kit
Synonyms:
CD117 antigen KIT Mast/stem cell growth factor receptor Kit (cKIT) Proto-oncogene tyrosine-protein kinase Kit Stem cell growth factor receptor Tyrosine-protein kinase Kit c-kit v-kit Hardy-Zuckerman 4 feline sarcoma viral oncogene homolog
Type:
Protein
Mol. Mass.:
109869.37
Organism:
Homo sapiens (Human)
Description:
P10721
Residue:
976
  
Inhibitor
Name:
BDBM369363
Synonyms:
4-[6-(4,4-difluoro-1-piperidyl)thieno[3,2- d]pyrimidin-4-yl]-N-[(1S)-1-(3- methoxyphenyl)ethyl]-2,2-dimethyl- piperazine-1-carboxamide | US10227357, Compound P-0680
Type:
Small organic molecule
Emp. Form.:
C27H34F2N6O2S
Mol. Mass.:
544.66
SMILES:
COc1cccc(c1)[C@H](C)NC(=O)N1CCN(CC1(C)C)c1ncnc2cc(sc12)N1CCC(F)(F)CC1
: