Target
Serine/threonine-protein kinase pim-1
Ligand
BDBM376736
Substrate
Meas. Tech.
Enzyme Assay
IC50
<10±n/a nM
Citation
 Vechorkin, OLi, YSokolsky, AWang, AZhu, WZhuo, J Heterocyclic compounds useful as Pim kinase inhibitors US Patent  US10450296 Publication Date 10/22/2019 
Target
Name:
Serine/threonine-protein kinase pim-1
Synonyms:
PIM-1 Kinase PIM1_HUMAN Serine/threonine-protein kinase (PIM1) Serine/threonine-protein kinase PIM1 | Serine/threonine-protein kinase pim-1 (PIM1)
Type:
Protein
Mol. Mass.:
35681.82
Organism:
Homo sapiens (Human)
Description:
P11309
Residue:
313
  
Inhibitor
Name:
BDBM376736
Synonyms:
N-(4-((1R,3S,5S)-3-Amino-5-methylcyclohexyl)pyridin-3-yl)-3-((R)-2-methylpyrrolidin-1-yl)quinoline-8-carboxamide US11053215, Example 68 | US9920032, Example 68
Type:
Small organic molecule
Emp. Form.:
C27H33N5O
Mol. Mass.:
443.5838
SMILES:
C[C@@H]1CCCN1c1cnc2c(cccc2c1)C(=O)Nc1cnccc1[C@@H]1C[C@H](C)C[C@H](N)C1
: