Target
Galectin-3
Ligand
BDBM21532
Substrate
BDBM21520
Meas. Tech.
Fluorescence Polarization Assay
pH
7.2±n/a
Temperature
297.15±n/a K
Kd
160000±n/a nM
Citation
 Salameh, BASundin, ALeffler, HNilsson, UJ Thioureido N-acetyllactosamine derivatives as potent galectin-7 and 9N inhibitors. Bioorg Med Chem 14:1215-20 (2006)  
Target
Name:
Galectin-3
Synonyms:
LEG3_HUMAN MAC2
Type:
Enzyme
Mol. Mass.:
26156.54
Organism:
Homo sapiens (Human)
Description:
P17931
Residue:
250
  
Inhibitor
Name:
BDBM21532
Synonyms:
N-[(2R,3R,4R,5S,6R)-5-{[(2S,3R,4S,5R,6R)-4-({[(2S,3R,4S,5R,6R)-2-{[(2R,3S,4R,5R,6R)-5-acetamido-4-hydroxy-2-(hydroxymethyl)-6-methoxyoxan-3-yl]oxy}-3,5-dihydroxy-6-(hydroxymethyl)oxan-4-yl]carbamothioyl}amino)-3,5-dihydroxy-6-(hydroxymethyl)oxan-2-yl]oxy}-4-hydroxy-6-(hydroxymethyl)-2-methoxyoxan-3-yl]acetamide | Thioureido N-acetyllactosamine derivative, 16
Type:
Emp. Form.:
C31H54N4O20S
Mol. Mass.:
834.84
SMILES:
CO[C@@H]1O[C@H](CO)[C@@H](O[C@@H]2O[C@H](CO)[C@H](O)[C@H](NC(=S)N[C@H]3[C@@H](O)[C@@H](CO)O[C@@H](O[C@H]4[C@H](O)[C@@H](NC(C)=O)[C@H](OC)O[C@@H]4CO)[C@@H]3O)[C@H]2O)[C@H](O)[C@H]1NC(C)=O
:
Substrate
Name:
BDBM21520
Synonyms:
fluorescein-tagged saccharide
Type:
fluorescent probe
Emp. Form.:
Mol. Mass.:
SMILES:
: