Target
Galectin-3
Ligand
BDBM21539
Substrate
BDBM21520
Meas. Tech.
Fluorescence Polarization Assay
pH
7.2±n/a
Temperature
297.15±n/a K
Kd
380000±10000 nM
Citation
 Oberg, CTLeffler, HNilsson, UJ Arginine binding motifs: design and synthesis of galactose-derived arginine tweezers as galectin-3 inhibitors. J Med Chem 51:2297-301 (2008)  
Target
Name:
Galectin-3
Synonyms:
LEG3_HUMAN MAC2
Type:
Enzyme
Mol. Mass.:
26156.54
Organism:
Homo sapiens (Human)
Description:
P17931
Residue:
250
  
Inhibitor
Name:
BDBM21539
Synonyms:
Galactose-Derived Compound 17 | N-[(2S,3R,4S,5R,6R)-3-(benzyloxy)-5-hydroxy-6-(hydroxymethyl)-2-(methylsulfanyl)oxan-4-yl]-4-methylbenzamide
Type:
Emp. Form.:
C22H27NO5S
Mol. Mass.:
417.518
SMILES:
CS[C@@H]1O[C@H](CO)[C@H](O)[C@H](NC(=O)c2ccc(C)cc2)[C@H]1OCc1ccccc1
:
Substrate
Name:
BDBM21520
Synonyms:
fluorescein-tagged saccharide
Type:
fluorescent probe
Emp. Form.:
Mol. Mass.:
SMILES:
: