Target
Galectin-3
Ligand
BDBM21540
Substrate
BDBM21520
Meas. Tech.
Fluorescence Polarization Assay
pH
7.2±n/a
Temperature
297.15±n/a K
Kd
220000±40000 nM
Citation
 Oberg, CTLeffler, HNilsson, UJ Arginine binding motifs: design and synthesis of galactose-derived arginine tweezers as galectin-3 inhibitors. J Med Chem 51:2297-301 (2008)  
Target
Name:
Galectin-3
Synonyms:
LEG3_HUMAN MAC2
Type:
Enzyme
Mol. Mass.:
26156.54
Organism:
Homo sapiens (Human)
Description:
P17931
Residue:
250
  
Inhibitor
Name:
BDBM21540
Synonyms:
Galactose-Derived Compound 18 | N-[(2R,3R,4S,5R,6S)-3,5-dihydroxy-2-(hydroxymethyl)-6-(methylsulfanyl)oxan-4-yl]-4-methylbenzamide
Type:
Small organic molecule
Emp. Form.:
C15H21NO5S
Mol. Mass.:
327.396
SMILES:
CS[C@@H]1O[C@H](CO)[C@H](O)[C@H](NC(=O)c2ccc(C)cc2)[C@H]1O
:
Substrate
Name:
BDBM21520
Synonyms:
fluorescein-tagged saccharide
Type:
fluorescent probe
Emp. Form.:
Mol. Mass.:
SMILES:
: