Target
Poly(ADP-ribose) glycohydrolase
Ligand
BDBM371428
Substrate
Meas. Tech.
PARG Assay
IC50
189±n/a nM
Citation
 McGonagle, AEJordan, AWaszkowycz, BHutton, CWaddell, IHitchin, JRSmith, KMHamilton, NM 2,4-dioxo-quinazoline-6-sulfonamide derivatives as inhibitors of PARG US Patent  US10239843 Publication Date 3/26/2019 
Target
Name:
Poly(ADP-ribose) glycohydrolase
Synonyms:
PARG Poly(ADP-ribose) glycohydrolase | poly(ADP-ribose) glycohydrolase (PARG)
Type:
Protein
Mol. Mass.:
111107.13
Organism:
Homo sapiens (Human)
Description:
Q86W56
Residue:
976
  
Inhibitor
Name:
BDBM371428
Synonyms:
N-[1-(Fluoromethyl)cyclopropyl]-3-[(1-methylpyrazol-4-yl)methyl]-1-[(5-methyl-2-pyridyl)methyl]-2,4-dioxo-quinazoline-6-sulfonamide | US10239843, Example 537
Type:
Small organic molecule
Emp. Form.:
C24H25FN6O4S
Mol. Mass.:
512.557
SMILES:
Cc1ccc(Cn2c3ccc(cc3c(=O)n(Cc3cnn(C)c3)c2=O)S(=O)(=O)NC2(CF)CC2)nc1
: