Target
Monocarboxylate transporter 1
Ligand
BDBM22026
Substrate
BDBM22022
Meas. Tech.
SPA Assay
pH
7.4±n/a
Temperature
295.15±n/a K
Ki
4.7±n/a nM
Citation
 Guile, SDBantick, JRCheshire, DRCooper, MEDavis, AMDonald, DKEvans, REyssade, CFerguson, DDHill, SHutchinson, RIngall, AHKingston, LPMartin, IMartin, BPMohammed, RTMurray, CPerry, MWReynolds, RHThorne, PVWilkinson, DJWithnall, J Potent blockers of the monocarboxylate transporter MCT1: novel immunomodulatory compounds. Bioorg Med Chem Lett 16:2260-5 (2006)  
Target
Name:
Monocarboxylate transporter 1
Synonyms:
MCT 1 MOT1_HUMAN SLC16A1 | Solute carrier family 16 member 1
Type:
PROTEIN
Mol. Mass.:
53956.64
Organism:
Homo sapiens (Human)
Description:
ChEMBL_1451367
Residue:
500
  
Inhibitor
Name:
BDBM22026
Synonyms:
5-{[(3R)-3-hydroxypyrrolidin-1-yl]carbonyl}-3-methyl-1-(2-methylpropyl)-6-{1H-pyrrolo[2,3-b]pyridin-3-ylmethyl}-1H,2H,3H,4H-thieno[2,3-d]pyrimidine-2,4-dione | Thieno[2,3-d]pyrimidine-2,4(1H,3H)-dione, 34
Type:
Small organic molecule
Emp. Form.:
C24H27N5O4S
Mol. Mass.:
481.567
SMILES:
CC(C)Cn1c2sc(Cc3c[nH]c4ncccc34)c(C(=O)N3CC[C@@H](O)C3)c2c(=O)n(C)c1=O
:
Substrate
Name:
BDBM22022
Synonyms:
6-benzyl-7-[(3-hydroxypropyl)sulfanyl]-2-methyl-4-(2-methylpropyl)-1H,2H,6H-pyrrolo[3,4-d]pyridazin-1-one [125I]-pyrrolo[3,4-d]pyridazin-1-one
Type:
radiolabeled ligand
Emp. Form.:
C21H27N3O2S
Mol. Mass.:
385.523
SMILES:
CC(C)Cc1nn(C)c(=O)c2c(SCCCO)n(Cc3ccccc3)cc12
: