Target
Sphingosine 1-phosphate receptor 5
Ligand
BDBM22218
Substrate
BDBM22202
Meas. Tech.
S1P Receptor Binding Assay
Temperature
298.15±n/a K
IC50
0.3±n/a nM
Comments
extracted
Citation
 Li, ZChen, WHale, JJLynch, CLMills, SGHajdu, RKeohane, CARosenbach, MJMilligan, JAShei, GJChrebet, GParent, SABergstrom, JCard, DForrest, MQuackenbush, EJWickham, LAVargas, HEvans, RMRosen, HMandala, S Discovery of potent 3,5-diphenyl-1,2,4-oxadiazole sphingosine-1-phosphate-1 (S1P1) receptor agonists with exceptional selectivity against S1P2 and S1P3. J Med Chem 48:6169-73 (2005)  
Target
Name:
Sphingosine 1-phosphate receptor 5
Synonyms:
EDG8 S1P5 S1PR5_HUMAN Sphingosine 1-phosphate receptor Edg-8
Type:
G Protein-Coupled Receptor (GPCR)
Mol. Mass.:
41796.42
Organism:
Homo sapiens (Human)
Description:
Residue:
398
  
Inhibitor
Name:
BDBM22218
Synonyms:
1,2,4-oxadiazole based compound, 35 | 1-[(4-{5-[4-(3,3,3-trifluoropropyl)phenyl]-1,2,4-oxadiazol-3-yl}phenyl)methyl]azetidine-3-carboxylic acid
Type:
Small organic molecule
Emp. Form.:
C22H20F3N3O3
Mol. Mass.:
431.4077
SMILES:
OC(=O)C1CN(Cc2ccc(cc2)-c2noc(n2)-c2ccc(CCC(F)(F)F)cc2)C1
:
Substrate
Name:
BDBM22202
Synonyms:
S1P [33P]S1P sphingosine-1-phosphate, 32P labeled {[(4Z)-2-amino-3-hydroxyoctadec-4-en-1-yl]oxy}phosphonic acid
Type:
radiolabeled ligand
Emp. Form.:
C18H38NO5P
Mol. Mass.:
379.4718
SMILES:
CCCCCCCCCCCCC\C=C/C(O)C(N)COP(O)(O)=O
: