Target
Transporter
Ligand
BDBM22404
Substrate
BDBM22417
Meas. Tech.
Ligand Binding Assay
Ki
>2000±n/a nM
Citation
 Gong, PKBlough, BEBrieaddy, LEHuang, XKuhar, MJNavarro, HACarroll, FI Synthesis, monoamine transporter binding, properties, and functional monoamine uptake activity of 3beta-[4-methylphenyl and 4-chlorophenyl]-2 beta-[5-(substituted phenyl)thiazol-2-yl]tropanes. J Med Chem 50:3686-95 (2007)  
Target
Name:
Transporter
Synonyms:
NE transporter Norepinephrine transporter(NET)
Type:
Multi-pass membrane protein
Mol. Mass.:
69236.90
Organism:
Rattus norvegicus (rat)
Description:
Q63380
Residue:
617
  
Inhibitor
Name:
BDBM22404
Synonyms:
2-[(1R,2S,3S,5S)-3-(4-chlorophenyl)-8-methyl-8-azabicyclo[3.2.1]octan-2-yl]-5-(3-nitrophenyl)-1,3-thiazole | WIN 35,065-2 Analogue, 4g
Type:
Small organic molecule
Emp. Form.:
C23H22ClN3O2S
Mol. Mass.:
439.958
SMILES:
CN1[C@H]2CC[C@@H]1[C@H]([C@H](C2)c1ccc(Cl)cc1)c1ncc(s1)-c1cccc(c1)[N+]([O-])=O
:
Substrate
Name:
BDBM22417
Synonyms:
3-(2-methoxyphenoxy)-N-methyl-3-phenylpropan-1-amine LY 135252 LY135252 Nisoxetine US9944618, Compound ID No. 177 [3H]Nisoxetine
Type:
radiolabeled ligand
Emp. Form.:
C17H21NO2
Mol. Mass.:
271.3541
SMILES:
CNCCC(Oc1ccccc1OC)c1ccccc1
: