Target
Genome polyprotein
Ligand
BDBM70437
Substrate
Meas. Tech.
Pseudotyped HCV particle (HCVpp) reporter assay
EC50
8.0±n/a nM
Citation
 Bilotta, JAChen, ZChi, FChin, EDing, QErickson, SDGabriel, SDJiang, NKocer, BMertz, EPlancher, JWeikert, RJZhang, JZhang, Q Antiviral compounds US Patent  US9693997 Publication Date 7/4/2017 
Target
Name:
Genome polyprotein
Synonyms:
Genome polyprotein RNA polymerase (NS5B)
Type:
Enzyme
Mol. Mass.:
326966.11
Organism:
Hepatitis C virus (HCV)
Description:
Q9WMX2
Residue:
3010
  
Inhibitor
Name:
BDBM70437
Synonyms:
US9693997, 107
Type:
Small organic molecule
Emp. Form.:
C16H13Cl2N5O
Mol. Mass.:
362.213
SMILES:
CC(=O)c1ccc(cc1)-c1c(Cl)cc(Nc2n[nH]c(N)n2)cc1Cl
: